Target
Adenosine receptor A2a
Ligand
BDBM50179053
Substrate
Meas. Tech.
ChEMBL_29993 (CHEMBL642181)
Ki
670±n/a nM
Citation
 Baraldi, PGCacciari, BPineda de Las Infantas, MJRomagnoli, RSpalluto, GVolpini, RCostanzi, SVittori, SCristalli, GMelman, NPark, KSJi, XDJacobson, KA Synthesis and biological activity of a new series of N6-arylcarbamoyl, 2-(Ar)alkynyl-N6-arylcarbamoyl, and N6-carboxamido derivatives of adenosine-5'-N-ethyluronamide as A1 and A3 adenosine receptor agonists. J Med Chem 41:3174-85 (1998)  
Target
Name:
Adenosine receptor A2a
Synonyms:
AA2AR_RAT Adenosine A2 receptor Adenosine Receptors A2a (A2a) Adenosine receptors A2a Rat striatal adenosine A2a receptor
Type:
G Protein-Coupled Receptor (GPCR)
Mol. Mass.:
45015.65
Organism:
Rattus norvegicus (rat)
Description:
Rat A2A receptors expressed in CHO cells.
Residue:
410
  
Inhibitor
Name:
BDBM50179053
Synonyms:
(2S,3S,4R,5R)-5-(6-benzamido-9H-purin-9-yl)-N-ethyl-3,4-dihydroxy-tetrahydrofuran-2-carboxamide | CHEMBL426669
Type:
Small organic molecule
Emp. Form.:
C19H20N6O5
Mol. Mass.:
412.3993
SMILES:
CCNC(=O)[C@H]1O[C@H]([C@H](O)[C@@H]1O)n1cnc2c(NC(=O)c3ccccc3)ncnc12
: