Target
Nitric oxide synthase, brain
Ligand
BDBM50066780
Substrate
Meas. Tech.
ChEMBL_143352 (CHEMBL750653)
IC50
4700±n/a nM
Citation
 Hagen, TJBergmanis, AAKramer, SWFok, KFSchmelzer, AEPitzele, BSSwenton, LJerome, GMKornmeier, CMMoore, WMBranson, LFConnor, JRManning, PTCurrie, MGHallinan, EA 2-Iminopyrrolidines as potent and selective inhibitors of human inducible nitric oxide synthase. J Med Chem 41:3675-83 (1998)  
Target
Name:
Nitric oxide synthase, brain
Synonyms:
Constitutive NOS NC-NOS NOS type I nNOS NOS1_HUMAN Neuronal nitric oxide synthase Nitric oxide synthase, neuronal (nNOS) bNOS | nNOS
Type:
Homodimer
Mol. Mass.:
160985.98
Organism:
Homo sapiens (Human)
Description:
P29475
Residue:
1434
  
Inhibitor
Name:
BDBM50066780
Synonyms:
4-Methyl-pyrrolidin-(2E)-ylideneamine; hydrochloride CHEMBL541090
Type:
Small organic molecule
Emp. Form.:
C5H10N2
Mol. Mass.:
98.1463
SMILES:
CC1CN=C(N)C1
: