Target
Sodium-dependent dopamine transporter
Ligand
BDBM50066910
Substrate
Meas. Tech.
ChEMBL_62972 (CHEMBL677462)
IC50
6500±n/a nM
Citation
 Campiani, GNacci, VBechelli, SCiani, SMGarofalo, AFiorini, IWikström, Hde Boer, PLiao, YTepper, PGCagnotto, AMennini, T New antipsychotic agents with serotonin and dopamine antagonist properties based on a pyrrolo[2,1-b][1,3]benzothiazepine structure. J Med Chem 41:3763-72 (1998)  
Target
Name:
Sodium-dependent dopamine transporter
Synonyms:
DA transporter DAT1 Dopamine transporter protein (DAT) SC6A3_HUMAN Sodium-dependent dopamine transporter Solute carrier family 6 member 3
Type:
Multi-pass membrane protein
Mol. Mass.:
68497.11
Organism:
Homo sapiens (Human)
Description:
Q01959
Residue:
620
  
Inhibitor
Name:
BDBM50066910
Synonyms:
(+/-)7-Chloro-9-(4-methyl-piperazin-1-yl)-9,10-dihydro-4-thia-10a-aza-benzo[f]azulene (S)-(+)-7-Chloro-9-(4-methyl-piperazin-1-yl)-9,10-dihydro-4-thia-10a-aza-benzo[f]azulene(ST1460) CHEMBL120512
Type:
Small organic molecule
Emp. Form.:
C17H20ClN3S
Mol. Mass.:
333.879
SMILES:
CN1CCN(CC1)C1Cn2cccc2Sc2ccc(Cl)cc12
: