Target
B2 bradykinin receptor
Ligand
BDBM50067261
Substrate
Meas. Tech.
ChEMBL_40264 (CHEMBL653280)
IC50
3.8±n/a nM
Citation
 Abe, YKayakiri, HSatoh, SInoue, TSawada, YInamura, NAsano, MHatori, CSawai, HOku, TTanaka, H A novel class of orally active non-peptide bradykinin B2 receptor antagonists. 2. Overcoming the species difference between guinea pig and man. J Med Chem 41:4053-61 (1998)  
Target
Name:
B2 bradykinin receptor
Synonyms:
B2 BRADYKININ B2R BK-2 receptor BKRB2_HUMAN | Bradykinin B2 receptor
Type:
Enzyme Catalytic Domain
Mol. Mass.:
44467.17
Organism:
Homo sapiens (Human)
Description:
B2 BRADYKININ BDKRB2 HUMAN::P30411
Residue:
391
  
Inhibitor
Name:
BDBM50067261
Synonyms:
CHEMBL556816 | N-[3-(3-Bromo-2-methyl-imidazo[1,2-a]pyridin-8-yloxymethyl)-2,4-dichloro-phenyl]-2-[3-(3-chloro-phenyl)-ureido]-N-methyl-acetamide; hydrochloride
Type:
Small organic molecule
Emp. Form.:
C25H21BrCl3N5O3
Mol. Mass.:
625.729
SMILES:
CN(C(=O)CNC(=O)Nc1cccc(Cl)c1)c1ccc(Cl)c(COc2cccn3c(Br)c(C)nc23)c1Cl
: