Target
B2 bradykinin receptor
Ligand
BDBM50067273
Substrate
Meas. Tech.
ChEMBL_40265 (CHEMBL656501)
IC50
>10000±n/a nM
Citation
 Abe, YKayakiri, HSatoh, SInoue, TSawada, YInamura, NAsano, MAramori, IHatori, CSawai, HOku, TTanaka, H A novel class of orally active non-peptide bradykinin B2 receptor antagonists. 3. Discovering bioisosteres of the imidazo[1,2-a] pyridine moiety. J Med Chem 41:4062-79 (1998)  
Target
Name:
B2 bradykinin receptor
Synonyms:
B2 bradykinin receptor BDKRB2 BKRB2_CAVPO | Bradykinin B2 receptor
Type:
Mol. Mass.:
42217.03
Organism:
Cavia porcellus
Description:
Residue:
372
  
Inhibitor
Name:
BDBM50067273
Synonyms:
4-{(E)-2-[({[2,4-Dichloro-3-(6-methyl-pyridin-2-ylmethoxymethyl)-phenyl]-methyl-carbamoyl}-methyl)-carbamoyl]-vinyl}-N-methyl-benzamide | CHEMBL133681
Type:
Small organic molecule
Emp. Form.:
C28H28Cl2N4O4
Mol. Mass.:
555.452
SMILES:
CNC(=O)c1ccc(\C=C\C(=O)NCC(=O)N(C)c2ccc(Cl)c(COCc3cccc(C)n3)c2Cl)cc1
: