Target
Acetylcholinesterase
Ligand
BDBM50422269
Substrate
Meas. Tech.
ChEMBL_28904 (CHEMBL638603)
IC50
309±n/a nM
Citation
 Melchiorre, CAndrisano, VBolognesi, MLBudriesi, RCavalli, ACavrini, VRosini, MTumiatti, VRecanatini, M Acetylcholinesterase noncovalent inhibitors based on a polyamine backbone for potential use against Alzheimer's disease. J Med Chem 41:4186-9 (1998)  
Target
Name:
Acetylcholinesterase
Synonyms:
ACES_HUMAN Acetylcholinesterase (AChE) | Acetylcholinesterase (human AChE)
Type:
Enzyme
Mol. Mass.:
67792.70
Organism:
Homo sapiens (Human)
Description:
P22303
Residue:
614
  
Inhibitor
Name:
BDBM50422269
Synonyms:
CHEMBL132377
Type:
Small organic molecule
Emp. Form.:
C38H62N4O4
Mol. Mass.:
638.9233
SMILES:
COc1ccccc1CNCCCCCC(=O)N(C)CCCCCCCCN(C)C(=O)CCCCCNCc1ccccc1OC
: