Target
D(2) dopamine receptor
Ligand
BDBM50025206
Substrate
Meas. Tech.
ChEMBL_60374 (CHEMBL672210)
Ki
340±n/a nM
Citation
 Wilcox, RETseng, TBrusniak, MYGinsburg, BPearlman, RSTeeter, MDuRand, CStarr, SNeve, KA CoMFA-based prediction of agonist affinities at recombinant D1 vs D2 dopamine receptors. J Med Chem 41:4385-99 (1998)  
Target
Name:
D(2) dopamine receptor
Synonyms:
D(2) dopamine receptor DOPAMINE D2 Long DRD2 Dopamine D2 receptor Dopamine D2 receptor (D2R) Dopamine2-like | d2
Type:
Cell-surface receptors
Mol. Mass.:
50647.10
Organism:
Homo sapiens (Human)
Description:
P14416
Residue:
443
  
Inhibitor
Name:
BDBM50025206
Synonyms:
(6,7-Dihydroxy-1,2,3,4-tetrahydro-naphthalen-2-yl)-dimethyl-ammonium | TL99
Type:
Small organic molecule
Emp. Form.:
C12H18NO2
Mol. Mass.:
208.2763
SMILES:
C[NH+](C)C1CCc2cc(O)c(O)cc2C1
: