Target
Sodium-dependent serotonin transporter
Ligand
BDBM50067816
Substrate
Meas. Tech.
ChEMBL_201671 (CHEMBL803045)
IC50
4300±n/a nM
Citation
 Efange, SMMash, DCKhare, ABOuyang, Q Modified ibogaine fragments: synthesis and preliminary pharmacological characterization of 3-ethyl-5-phenyl-1,2,3,4,5, 6-hexahydroazepino[4,5-b]benzothiophenes. J Med Chem 41:4486-91 (1998)  
Target
Name:
Sodium-dependent serotonin transporter
Synonyms:
5-HT Transporter 5HT transporter Anandamid membrane transporter, AMT Monoamine transporters; Norepinephrine & serotonin Slc6a4 Sodium-dependent serotonin transporter (SERT) | imipramine receptor
Type:
Multi-pass membrane protein
Mol. Mass.:
70168.43
Organism:
Rattus norvegicus (rat)
Description:
P31652
Residue:
630
  
Inhibitor
Name:
BDBM50067816
Synonyms:
9-(3-Bromo-phenyl)-7-ethyl-6,7,8,9-tetrahydro-5H-10-thia-7-aza-benzo[a]azulene | CHEMBL139081
Type:
Small organic molecule
Emp. Form.:
C20H20BrNS
Mol. Mass.:
386.349
SMILES:
CCN1CCc2c(sc3ccccc23)C(C1)c1cccc(Br)c1
: