Target
B2 bradykinin receptor
Ligand
BDBM50067921
Substrate
Meas. Tech.
ChEMBL_40294 (CHEMBL884128)
IC50
2.6±n/a nM
Citation
 Abe, YKayakiri, HSatoh, SInoue, TSawada, YInamura, NAsano, MAramori, IHatori, CSawai, HOku, TTanaka, H A novel class of orally active non-peptide bradykinin B2 receptor antagonists. 4. Discovery of novel frameworks mimicking the active conformation. J Med Chem 41:4587-98 (1998)  
Target
Name:
B2 bradykinin receptor
Synonyms:
B2 BRADYKININ B2R BK-2 receptor BKRB2_HUMAN | Bradykinin B2 receptor
Type:
Enzyme Catalytic Domain
Mol. Mass.:
44467.17
Organism:
Homo sapiens (Human)
Description:
B2 BRADYKININ BDKRB2 HUMAN::P30411
Residue:
391
  
Inhibitor
Name:
BDBM50067921
Synonyms:
4-((E)-2-{[2',4'-Dimethyl-3'-(2-methyl-quinolin-8-yloxymethyl)-biphenyl-2-ylmethyl]-carbamoyl}-vinyl)-N-methyl-benzamide | CHEMBL140383
Type:
Small organic molecule
Emp. Form.:
C37H35N3O3
Mol. Mass.:
569.6921
SMILES:
CNC(=O)c1ccc(\C=C\C(=O)NCc2ccccc2-c2ccc(C)c(COc3cccc4ccc(C)nc34)c2C)cc1
: