Target
Kappa-type opioid receptor
Ligand
BDBM50041144
Substrate
Meas. Tech.
ChEMBL_146379 (CHEMBL754736)
Ki
838±n/a nM
Citation
 Tourwé, DMannekens, EDiem, TNVerheyden, PJaspers, HTóth, GPéter, AKertész, ITörök, GChung, NNSchiller, PW Side chain methyl substitution in the delta-opioid receptor antagonist TIPP has an important effect on the activity profile. J Med Chem 41:5167-76 (1999)  
Target
Name:
Kappa-type opioid receptor
Synonyms:
Kappa Opioid Receptor OPRK1 Opiate Kappa 1 | mu/kappa opioid receptor
Type:
G Protein-Coupled Receptor (GPCR)
Mol. Mass.:
42744.99
Organism:
Cavia porcellus (domestic guinea pig)
Description:
P41144
Residue:
380
  
Inhibitor
Name:
BDBM50041144
Synonyms:
(S)-2-Amino-N-((5S,8S)-5-benzyl-4,7,13,16-tetraoxo-hexadecahydro-3a,6,12,15-tetraaza-cyclopentacyclopentadecen-8-yl)-3-(4-hydroxy-phenyl)-propionamide | CHEMBL557035
Type:
Small organic molecule
Emp. Form.:
C37H39N5O5
Mol. Mass.:
633.7361
SMILES:
N[C@@H](Cc1ccc(O)cc1)C(=O)N1Cc2ccccc2C[C@H]1C(=O)N[C@@H](Cc1ccccc1)C(=O)N[C@@H](Cc1ccccc1)C(N)=O
: