Target
Kappa-type opioid receptor
Ligand
BDBM50068646
Substrate
Meas. Tech.
ChEMBL_146379 (CHEMBL754736)
Ki
>10000±n/a nM
Citation
 Tourwé, DMannekens, EDiem, TNVerheyden, PJaspers, HTóth, GPéter, AKertész, ITörök, GChung, NNSchiller, PW Side chain methyl substitution in the delta-opioid receptor antagonist TIPP has an important effect on the activity profile. J Med Chem 41:5167-76 (1999)  
Target
Name:
Kappa-type opioid receptor
Synonyms:
Kappa Opioid Receptor OPRK1 Opiate Kappa 1 | mu/kappa opioid receptor
Type:
G Protein-Coupled Receptor (GPCR)
Mol. Mass.:
42744.99
Organism:
Cavia porcellus (domestic guinea pig)
Description:
P41144
Residue:
380
  
Inhibitor
Name:
BDBM50068646
Synonyms:
2-[2-({(R)-2-[2-Amino-3-(4-hydroxy-phenyl)-propionyl]-4-methyl-1,2,3,4-tetrahydro-isoquinoline-3-carbonyl}-amino)-3-phenyl-propionylamino]-3-phenyl-propionic acid | CHEMBL2371017
Type:
Small organic molecule
Emp. Form.:
C38H40N4O6
Mol. Mass.:
648.7474
SMILES:
C[C@H]1[C@H](N(Cc2ccccc12)C(=O)[C@@H](N)Cc1ccc(O)cc1)C(=O)N[C@@H](Cc1ccccc1)C(=O)N[C@@H](Cc1ccccc1)C(O)=O
: