Target
B2 bradykinin receptor
Ligand
BDBM50062891
Substrate
Meas. Tech.
ChEMBL_40262 (CHEMBL653278)
IC50
54±n/a nM
Citation
 Abe, YKayakiri, HSatoh, SInoue, TSawada, YImai, KInamura, NAsano, MHatori, CKatayama, AOku, TTanaka, H A novel class of orally active non-peptide bradykinin B2 receptor antagonists. 1. Construction of the basic framework. J Med Chem 41:564-78 (1998)  
Target
Name:
B2 bradykinin receptor
Synonyms:
B2 bradykinin receptor BDKRB2 BKRB2_CAVPO | Bradykinin B2 receptor
Type:
Mol. Mass.:
42217.03
Organism:
Cavia porcellus
Description:
Residue:
372
  
Inhibitor
Name:
BDBM50062891
Synonyms:
CHEMBL358234 | N-[3-(3-Bromo-2-methyl-imidazo[1,2-a]pyridin-8-yloxymethyl)-2,4-dichloro-phenyl]-N-methyl-acetamide
Type:
Small organic molecule
Emp. Form.:
C18H16BrCl2N3O2
Mol. Mass.:
457.149
SMILES:
CN(C(C)=O)c1ccc(Cl)c(COc2cccn3c(Br)c(C)nc23)c1Cl
: