Target
Androgen receptor
Ligand
BDBM50063100
Substrate
Meas. Tech.
ChEMBL_36107 (CHEMBL648072)
IC50
35±n/a nM
Citation
 Hamann, LGHiguchi, RIZhi, LEdwards, JPWang, XNMarschke, KBKong, JWFarmer, LJJones, TK Synthesis and biological activity of a novel series of nonsteroidal, peripherally selective androgen receptor antagonists derived from 1,2-dihydropyridono[5,6-g]quinolines. J Med Chem 41:623-39 (1998)  
Target
Name:
Androgen receptor
Synonyms:
ANDR_HUMAN Androgen Receptor Androgen receptor/Baculoviral IAP repeat-containing protein 2 Dihydrotestosterone receptor Nuclear receptor subfamily 3 group C member 4
Type:
Receptor
Mol. Mass.:
99185.27
Organism:
Homo sapiens (Human)
Description:
CHO cells were stably transfected with human AR gene.
Residue:
920
  
Inhibitor
Name:
BDBM50063100
Synonyms:
6'-trifluoromethylspiro[cyclohexane-1,2'-(1',2',3',4',8',9'-hexahydropyrido[3,2-g]quinoline)]-8'-one | CHEMBL345854
Type:
Small organic molecule
Emp. Form.:
C18H19F3N2O
Mol. Mass.:
336.3515
SMILES:
FC(F)(F)c1cc(=O)[nH]c2cc3NC4(CCCCC4)CCc3cc12
: