Target
Progesterone receptor
Ligand
BDBM35909
Substrate
Meas. Tech.
ChEMBL_159377 (CHEMBL768810)
IC50
2013±n/a nM
Citation
 Hamann, LGHiguchi, RIZhi, LEdwards, JPWang, XNMarschke, KBKong, JWFarmer, LJJones, TK Synthesis and biological activity of a novel series of nonsteroidal, peripherally selective androgen receptor antagonists derived from 1,2-dihydropyridono[5,6-g]quinolines. J Med Chem 41:623-39 (1998)  
Target
Name:
Progesterone receptor
Synonyms:
NR3C3 PGR PRGR_HUMAN | progesterone
Type:
Protein
Mol. Mass.:
98979.52
Organism:
Homo sapiens (Human)
Description:
P06401
Residue:
933
  
Inhibitor
Name:
BDBM35909
Synonyms:
2-Hydroxy-2-methyl-N-(4-nitro-3-trifluoromethyl-phenyl)-propionamide 2-Hydroxy-2-methyl-N-(4-nitro-3-trifluoromethyl-phenyl)-propionamide(Hydroxyflutamide) CHEMBL491 Hydroxyflutamide Sch 16423 cid_91649 | hydroxy-flutamide
Type:
Small organic molecule
Emp. Form.:
C11H11F3N2O4
Mol. Mass.:
292.2112
SMILES:
CC(C)(O)C(=O)Nc1ccc(c(c1)C(F)(F)F)[N+]([O-])=O
: