Target
Androgen receptor
Ligand
BDBM50063110
Substrate
Meas. Tech.
ChEMBL_36107 (CHEMBL648072)
IC50
24±n/a nM
Citation
 Hamann, LGHiguchi, RIZhi, LEdwards, JPWang, XNMarschke, KBKong, JWFarmer, LJJones, TK Synthesis and biological activity of a novel series of nonsteroidal, peripherally selective androgen receptor antagonists derived from 1,2-dihydropyridono[5,6-g]quinolines. J Med Chem 41:623-39 (1998)  
Target
Name:
Androgen receptor
Synonyms:
ANDR_HUMAN Androgen Receptor Androgen receptor/Baculoviral IAP repeat-containing protein 2 Dihydrotestosterone receptor Nuclear receptor subfamily 3 group C member 4
Type:
Receptor
Mol. Mass.:
99185.27
Organism:
Homo sapiens (Human)
Description:
CHO cells were stably transfected with human AR gene.
Residue:
920
  
Inhibitor
Name:
BDBM50063110
Synonyms:
8-Ethyl-1,8,9-trimethyl-4-trifluoromethyl-6,7,8,9-tetrahydro-1H-pyrido[3,2-g]quinolin-2-one | CHEMBL160230
Type:
Small organic molecule
Emp. Form.:
C18H21F3N2O
Mol. Mass.:
338.3673
SMILES:
CCC1(C)CCc2cc3c(cc(=O)n(C)c3cc2N1C)C(F)(F)F
: