Target
Progesterone receptor
Ligand
BDBM50063126
Substrate
Meas. Tech.
ChEMBL_159377 (CHEMBL768810)
IC50
3346±n/a nM
Citation
 Hamann, LGHiguchi, RIZhi, LEdwards, JPWang, XNMarschke, KBKong, JWFarmer, LJJones, TK Synthesis and biological activity of a novel series of nonsteroidal, peripherally selective androgen receptor antagonists derived from 1,2-dihydropyridono[5,6-g]quinolines. J Med Chem 41:623-39 (1998)  
Target
Name:
Progesterone receptor
Synonyms:
NR3C3 PGR PRGR_HUMAN | progesterone
Type:
Protein
Mol. Mass.:
98979.52
Organism:
Homo sapiens (Human)
Description:
P06401
Residue:
933
  
Inhibitor
Name:
BDBM50063126
Synonyms:
6,8,8,10-Tetramethyl-4-trifluoromethyl-8,9-dihydro-1H-pyrido[3,2-g]quinolin-2-one | CHEMBL157703
Type:
Small organic molecule
Emp. Form.:
C17H17F3N2O
Mol. Mass.:
322.3249
SMILES:
CC1=CC(C)(C)Nc2c(C)c3[nH]c(=O)cc(c3cc12)C(F)(F)F
: