Target
Progesterone receptor
Ligand
BDBM50063111
Substrate
Meas. Tech.
ChEMBL_159377 (CHEMBL768810)
IC50
1239±n/a nM
Citation
 Hamann, LGHiguchi, RIZhi, LEdwards, JPWang, XNMarschke, KBKong, JWFarmer, LJJones, TK Synthesis and biological activity of a novel series of nonsteroidal, peripherally selective androgen receptor antagonists derived from 1,2-dihydropyridono[5,6-g]quinolines. J Med Chem 41:623-39 (1998)  
Target
Name:
Progesterone receptor
Synonyms:
NR3C3 PGR PRGR_HUMAN | progesterone
Type:
Protein
Mol. Mass.:
98979.52
Organism:
Homo sapiens (Human)
Description:
P06401
Residue:
933
  
Inhibitor
Name:
BDBM50063111
Synonyms:
1,8,8-Trimethyl-4-trifluoromethyl-6,7,8,9-tetrahydro-1H-pyrido[3,2-g]quinolin-2-one | CHEMBL346827
Type:
Small organic molecule
Emp. Form.:
C16H17F3N2O
Mol. Mass.:
310.3142
SMILES:
Cn1c2cc3NC(C)(C)CCc3cc2c(cc1=O)C(F)(F)F
: