Target
Sodium-dependent dopamine transporter
Ligand
BDBM50455445
Substrate
Meas. Tech.
ChEMBL_176336 (CHEMBL784029)
IC50
3.5±n/a nM
Citation
 Lieske, SFYang, BEldefrawi, MEMacKerell, ADWright, J (-)-3 beta-Substituted ecgonine methyl esters as inhibitors for cocaine binding and dopamine uptake. J Med Chem 41:864-76 (1998)  
Target
Name:
Sodium-dependent dopamine transporter
Synonyms:
DA transporter SC6A3_RAT Sodium-dependent dopamine transporter | Sodium-dependent dopamine transporter (DAT)
Type:
Multi-pass membrane protein
Mol. Mass.:
68749.45
Organism:
Rattus norvegicus (rat)
Description:
P23977
Residue:
619
  
Inhibitor
Name:
BDBM50455445
Synonyms:
CHEMBL2112045
Type:
Small organic molecule
Emp. Form.:
C20H23NO2
Mol. Mass.:
309.4021
SMILES:
[H][C@@]12CCC([C@@H]([C@@H](C1)c1ccc3ccccc3c1)C(=O)OC)N2C
: