Target
Aldo-keto reductase family 1 member B1 [K65Q]
Ligand
BDBM7460
Substrate
Meas. Tech.
ChEMBL_31467 (CHEMBL647989)
IC50
32870±n/a nM
Citation
 Costantino, LRastelli, GGamberini, MCVinson, JABose, PIannone, AStaffieri, MAntolini, LDel Corso, AMura, UAlbasini, A 1-Benzopyran-4-one antioxidants as aldose reductase inhibitors. J Med Chem 42:1881-93 (1999)  
Target
Name:
Aldo-keto reductase family 1 member B1 [K65Q]
Synonyms:
AKR1B1 Aldose reductase
Type:
Protein
Mol. Mass.:
35916.27
Organism:
Bos taurus (Cattle)
Description:
P16116[K65Q]
Residue:
315
  
Inhibitor
Name:
BDBM7460
Synonyms:
2-(3,4-dihydroxyphenyl)-3,5,7-trihydroxy-4H-chromen-4-one 2-(3,4-dihydroxyphenyl)-3,5,7-trihydroxy-chromone;hydrate Quercetin Quercetin (21) US11021454, Compound Quercetin med.21724, Compound 4
Type:
Small organic molecule
Emp. Form.:
C15H10O7
Mol. Mass.:
302.2357
SMILES:
Oc1cc(O)c2c(c1)oc(-c1ccc(O)c(O)c1)c(O)c2=O
: