Target
Histamine H2 receptor
Ligand
BDBM112777
Substrate
Meas. Tech.
ChEMBL_85065 (CHEMBL692776)
IC50
7000±n/a nM
Citation
 Quiñones-Torrelo, CSagrado, SVillanueva-Camañas, RMMedina-Hernández, MJ Development of predictive retention-activity relationship models of tricyclic antidepressants by micellar liquid chromatography. J Med Chem 42:3154-62 (1999)  
Target
Name:
Histamine H2 receptor
Synonyms:
Gastric receptor I HISTAMINE H2 HRH2_CAVPO | Histamine H2-Gs alpha S
Type:
G Protein-Coupled Receptor (GPCR)
Mol. Mass.:
40567.22
Organism:
Cavia porcellus (domestic guinea pig)
Description:
For the H2 receptor-binding assays, guinea pig striatum was used.
Residue:
359
  
Inhibitor
Name:
BDBM112777
Synonyms:
NORTRIPTYLINE | US8629135, SW-02
Type:
Small organic molecule
Emp. Form.:
C19H21N
Mol. Mass.:
263.3767
SMILES:
[#6]-[#7]-[#6]-[#6]\[#6]=[#6]-1/c2ccccc2-[#6]-[#6]-c2ccccc-12
: