Target
Histamine H2 receptor
Ligand
BDBM31005
Substrate
Meas. Tech.
ChEMBL_85065 (CHEMBL692776)
IC50
880±n/a nM
Citation
 Quiñones-Torrelo, CSagrado, SVillanueva-Camañas, RMMedina-Hernández, MJ Development of predictive retention-activity relationship models of tricyclic antidepressants by micellar liquid chromatography. J Med Chem 42:3154-62 (1999)  
Target
Name:
Histamine H2 receptor
Synonyms:
Gastric receptor I HISTAMINE H2 HRH2_CAVPO | Histamine H2-Gs alpha S
Type:
G Protein-Coupled Receptor (GPCR)
Mol. Mass.:
40567.22
Organism:
Cavia porcellus (domestic guinea pig)
Description:
For the H2 receptor-binding assays, guinea pig striatum was used.
Residue:
359
  
Inhibitor
Name:
BDBM31005
Synonyms:
2-methyl-1,2,3,4,10,14b-hexahydrodibenzo[c,f]pyrazino[1,2-a]azepine MLS000069681 cid_68551
Type:
Small organic molecule
Emp. Form.:
C18H21ClN2
Mol. Mass.:
300.826
SMILES:
Cl.CN1CCN2C(C1)c1ccccc1Cc1ccccc21
: