Target
Protein farnesyltransferase subunit beta/geranylgeranyltransferase type-1 subunit alpha
Ligand
BDBM50079974
Substrate
Meas. Tech.
ChEMBL_70604 (CHEMBL678495)
IC50
0.12±n/a nM
Citation
 Anthony, NJGomez, RPSchaber, MDMosser, SDHamilton, KAO'Neil, TJKoblan, KSGraham, SLHartman, GDShah, DRands, EKohl, NEGibbs, JBOliff, AI Design and in vivo analysis of potent non-thiol inhibitors of farnesyl protein transferase. J Med Chem 42:3356-68 (1999)  
Target
Name:
Protein farnesyltransferase subunit beta/geranylgeranyltransferase type-1 subunit alpha
Synonyms:
Farnesyltransferase (FTase) Protein Farnesyltransferase (PFT) Chain B | Protein farnesyltransferase
Type:
Protein Complex
Mol. Mass.:
Description:
To express recombinant enzyme in E. coli, the cloned human alpha and beta subunits were co-expressed from a plasmid, in which their expression was translationally coupled.
Components:
This complex has 2 components.
Component 1
Name:
Protein farnesyltransferase subunit beta
Synonyms:
CAAX farnesyltransferase subunit alpha FNTB FTase-alpha GGTase-I-alpha Protein farnesyl/geranylgeranyl transferase Protein farnesyltransferase subunit beta Protein farnesyltransferase/geranylgeranyltransferase type-1 subunit alpha Ras proteins prenyltransferase subunit beta | Type I protein geranyl-geranyltransferase subunit alpha
Type:
Enzyme Subunit
Mol. Mass.:
48766.02
Organism:
Homo sapiens (Human)
Description:
Protein farnesyltransferase subunit beta
Residue:
437
  
Component 2
Name:
Protein farnesyltransferase/geranylgeranyltransferase type-1 subunit alpha
Synonyms:
CAAX farnesyltransferase alpha subunit FNTA_HUMAN FTase-alpha Geranylgeranyl Transferase (GGTase-I) Chain A Protein Farnesyltransferase (PFT) Chain A Protein farnesyltransferase Protein farnesyltransferase/geranylgeranyltransferase type I alpha subunit | Ras proteins prenyltransferase alpha
Type:
Enzyme
Mol. Mass.:
44392.46
Organism:
Homo sapiens (Human)
Description:
Recombinant human FTase.
Residue:
379
  
Inhibitor
Name:
BDBM50079974
Synonyms:
(S)-2-[2-({(S)-3-Methyl-2-[2-(3-naphthalen-1-ylmethyl-3H-imidazol-4-yl)-acetylamino]-pentyl}-naphthalen-1-ylmethyl-amino)-acetylamino]-4-methylsulfanyl-butyric acid | CHEMBL327106
Type:
Small organic molecule
Emp. Form.:
C40H47N5O4S
Mol. Mass.:
693.897
SMILES:
CCC(C)[C@@H](CN(CC(=O)N[C@@H](CCSC)C(O)=O)Cc1cccc2ccccc12)NC(=O)Cc1cncn1Cc1cccc2ccccc12
: