Target
Sodium-dependent dopamine transporter
Ligand
BDBM50080418
Substrate
Meas. Tech.
ChEMBL_62485 (CHEMBL677377)
Ki
15±n/a nM
Citation
 Newman, AHIzenwasser, SRobarge, MJKline, RH CoMFA study of novel phenyl ring-substituted 3alpha-(diphenylmethoxy)tropane analogues at the dopamine transporter. J Med Chem 42:3502-9 (1999)  
Target
Name:
Sodium-dependent dopamine transporter
Synonyms:
DA transporter SC6A3_RAT Sodium-dependent dopamine transporter | Sodium-dependent dopamine transporter (DAT)
Type:
Multi-pass membrane protein
Mol. Mass.:
68749.45
Organism:
Rattus norvegicus (rat)
Description:
P23977
Residue:
619
  
Inhibitor
Name:
BDBM50080418
Synonyms:
3-[(4-Bromo-phenyl)-(4-fluoro-phenyl)-methoxy]-8-methyl-8-aza-bicyclo[3.2.1]octane | CHEMBL118467
Type:
Small organic molecule
Emp. Form.:
C21H23BrFNO
Mol. Mass.:
404.316
SMILES:
CN1C2CCC1CC(C2)OC(c1ccc(F)cc1)c1ccc(Br)cc1
: