Target
Delta-type opioid receptor
Ligand
BDBM50123273
Substrate
Meas. Tech.
ChEMBL_147191 (CHEMBL759364)
Ki
0.78±n/a nM
Citation
 Ananthan, SKezar, HSCarter, RLSaini, SKRice, KCWells, JLDavis, PXu, HDersch, CMBilsky, EJPorreca, FRothman, RB Synthesis, opioid receptor binding, and biological activities of naltrexone-derived pyrido- and pyrimidomorphinans. J Med Chem 42:3527-38 (1999)  
Target
Name:
Delta-type opioid receptor
Synonyms:
Cytochrome P450 3A4 Delta opioid receptor Delta-type opioid receptor (DOR) OPRD_RAT Opioid receptor Opioid receptors; mu & delta Ror-a | Voltage-gated potassium channel
Type:
G Protein-Coupled Receptor (GPCR)
Mol. Mass.:
40465.04
Organism:
Rattus norvegicus (rat)
Description:
Competition binding assays were using CHO-K1 cell membranes expressing the opioid receptor.
Residue:
372
  
Inhibitor
Name:
BDBM50123273
Synonyms:
19-cyclopropylmethyl-(2S,10R)-11-oxa-8,19-diazahexacyclo[10.9.1.01,10.02,18.04,9.016,22]docosa-4(9),5,7,12,14,16(22)-hexaene-2,13-diol CHEMBL346173
Type:
Small organic molecule
Emp. Form.:
C23H24N2O3
Mol. Mass.:
376.4483
SMILES:
Oc1ccc2C[C@H]3N(CC4CC4)CC[C@@]45[C@@H](Oc1c24)c1ncccc1C[C@@]35O
: