Target
Anionic trypsin
Ligand
BDBM13279
Substrate
Meas. Tech.
ChEMBL_212180 (CHEMBL817744)
Ki
530±n/a nM
Citation
 Ewing, WRBecker, MRManetta, VEDavis, RSPauls, HWMason, HChoi-Sledeski, YMGreen, DCha, DSpada, APCheney, DLMason, JSMaignan, SGuilloteau, JPBrown, KColussi, DBentley, RBostwick, JKasiewski, CJMorgan, SRLeadley, RJDunwiddie, CTPerrone, MHChu, V Design and structure-activity relationships of potent and selective inhibitors of blood coagulation factor Xa. J Med Chem 42:3557-71 (1999)  
Target
Name:
Anionic trypsin
Synonyms:
Anionic trypsin Trypsin II
Type:
PROTEIN
Mol. Mass.:
26281.39
Organism:
Bos taurus
Description:
ChEMBL_212177
Residue:
247
  
Inhibitor
Name:
BDBM13279
Synonyms:
4-{[(3S)-3-[(7-methoxynaphthalene-2-)(methyl)sulfonamido]-2-oxopyrrolidin-1-yl]methyl}thiophene-2-carboximidamide CHEMBL84638 Sulfonamidopyrrolidinone
Type:
Small organic molecule
Emp. Form.:
C22H24N4O4S2
Mol. Mass.:
472.58
SMILES:
COc1ccc2ccc(cc2c1)S(=O)(=O)N(C)[C@H]1CCN(Cc2csc(c2)C(N)=N)C1=O
: