Target
P2Y purinoceptor 1
Ligand
BDBM50408723
Substrate
Meas. Tech.
ChEMBL_147712 (CHEMBL759182)
EC50
21.0±n/a nM
Citation
 Fischer, BChulkin, ABoyer, JLHarden, KTGendron, FPBeaudoin, ARChapal, JHillaire-Buys, DPetit, P 2-thioether 5'-O-(1-thiotriphosphate)adenosine derivatives as new insulin secretagogues acting through P2Y-Receptors. J Med Chem 42:3636-46 (1999)  
Target
Name:
P2Y purinoceptor 1
Synonyms:
P2RY1 | P2RY1_MELGA
Type:
Mol. Mass.:
41199.64
Organism:
Meleagris gallopavo
Description:
Residue:
362
  
Inhibitor
Name:
BDBM50408723
Synonyms:
CHEMBL2092793
Type:
Small organic molecule
Emp. Form.:
C16H28N5O12P3S2
Mol. Mass.:
639.471
SMILES:
CCCCCCSc1nc(N)c2ncn([C@@H]3O[C@H](COP(O)(=S)OP(O)(=O)OP(O)(O)=O)[C@@H](O)[C@H]3O)c2n1
: