Target
Protein farnesyltransferase subunit beta/geranylgeranyltransferase type-1 subunit alpha
Ligand
BDBM50081238
Substrate
Meas. Tech.
ChEMBL_70574 (CHEMBL682707)
IC50
453±n/a nM
Citation
 Gibbs, BSZahn, TJMu, YSebolt-Leopold, JSGibbs, RA Novel farnesol and geranylgeraniol analogues: A potential new class of anticancer agents directed against protein prenylation. J Med Chem 42:3800-8 (1999)  
Target
Name:
Protein farnesyltransferase subunit beta/geranylgeranyltransferase type-1 subunit alpha
Synonyms:
Farnesyltransferase (FTase) Protein Farnesyltransferase (PFT) Chain B | Protein farnesyltransferase
Type:
Protein Complex
Mol. Mass.:
Description:
To express recombinant enzyme in E. coli, the cloned human alpha and beta subunits were co-expressed from a plasmid, in which their expression was translationally coupled.
Components:
This complex has 2 components.
Component 1
Name:
Protein farnesyltransferase subunit beta
Synonyms:
CAAX farnesyltransferase subunit alpha FNTB FTase-alpha GGTase-I-alpha Protein farnesyl/geranylgeranyl transferase Protein farnesyltransferase subunit beta Protein farnesyltransferase/geranylgeranyltransferase type-1 subunit alpha Ras proteins prenyltransferase subunit beta | Type I protein geranyl-geranyltransferase subunit alpha
Type:
Enzyme Subunit
Mol. Mass.:
48766.02
Organism:
Homo sapiens (Human)
Description:
Protein farnesyltransferase subunit beta
Residue:
437
  
Component 2
Name:
Protein farnesyltransferase/geranylgeranyltransferase type-1 subunit alpha
Synonyms:
CAAX farnesyltransferase alpha subunit FNTA_HUMAN FTase-alpha Geranylgeranyl Transferase (GGTase-I) Chain A Protein Farnesyltransferase (PFT) Chain A Protein farnesyltransferase Protein farnesyltransferase/geranylgeranyltransferase type I alpha subunit | Ras proteins prenyltransferase alpha
Type:
Enzyme
Mol. Mass.:
44392.46
Organism:
Homo sapiens (Human)
Description:
Recombinant human FTase.
Residue:
379
  
Inhibitor
Name:
BDBM50081238
Synonyms:
4-[(Z)-ethylidene]-8,12,16-trimethyl-(7E,11E)-1,7,11,15-heptadecatetraene1-diphosphate (3-alGGPP)
Type:
Small organic molecule
Emp. Form.:
C22H35O7P2
Mol. Mass.:
473.4583
SMILES:
[#6]\[#6](-[#6])=[#6]/[#6]-[#6]\[#6](-[#6])=[#6]\[#6]-[#6]\[#6](-[#6])=[#6]\[#6]-[#6]\[#6](-[#6]-[#6]=[#6])=[#6]\[#6]-[#8]P([#8-])(=O)[#8]P([#8-])([#8-])=O
: