Target
Cholecystokinin receptor type A
Ligand
BDBM50082644
Substrate
Meas. Tech.
ChEMBL_50043 (CHEMBL662412)
IC50
23±n/a nM
Citation
 Bartolomé-Nebreda, JMGómez-Monterrey, IGarcía-López, MTGonzález-Muñiz, RMartín-Martínez, MBallaz, SCenarruzabeitia, ELaTorre, MDel Río, JHerranz, R 5-(Tryptophyl)amino-1,3-dioxoperhydropyrido[1,2-c]pyrimidine-based potent and selective CCK(1) receptor antagonists: structural modifications at the tryptophan domain. J Med Chem 42:4659-68 (1999)  
Target
Name:
Cholecystokinin receptor type A
Synonyms:
CCKAR_RAT Cholecystokinin peripheral Cholecystokinin receptor type A
Type:
Enzyme Catalytic Domain
Mol. Mass.:
49676.37
Organism:
RAT
Description:
Cholecystokinin central 0 RAT::P30551
Residue:
444
  
Inhibitor
Name:
BDBM50082644
Synonyms:
CHEMBL356765 | [1-((4aS,5S)-2-Benzyl-1,3-dioxo-octahydro-pyrido[1,2-c]pyrimidin-5-ylcarbamoyl)-2-(1H-indol-3-yl)-ethyl]-carbamic acid tert-butyl ester
Type:
Small organic molecule
Emp. Form.:
C31H37N5O5
Mol. Mass.:
559.656
SMILES:
CC(C)(C)OC(=O)NC(Cc1c[nH]c2ccccc12)C(=O)N[C@H]1CCCN2[C@H]1CC(=O)N(Cc1ccccc1)C2=O
: