Target
Cholecystokinin receptor type A
Ligand
BDBM50005463
Substrate
Meas. Tech.
ChEMBL_50043 (CHEMBL662412)
IC50
0.71±n/a nM
Citation
 Bartolomé-Nebreda, JMGómez-Monterrey, IGarcía-López, MTGonzález-Muñiz, RMartín-Martínez, MBallaz, SCenarruzabeitia, ELaTorre, MDel Río, JHerranz, R 5-(Tryptophyl)amino-1,3-dioxoperhydropyrido[1,2-c]pyrimidine-based potent and selective CCK(1) receptor antagonists: structural modifications at the tryptophan domain. J Med Chem 42:4659-68 (1999)  
Target
Name:
Cholecystokinin receptor type A
Synonyms:
CCKAR_RAT Cholecystokinin peripheral Cholecystokinin receptor type A
Type:
Enzyme Catalytic Domain
Mol. Mass.:
49676.37
Organism:
RAT
Description:
Cholecystokinin central 0 RAT::P30551
Residue:
444
  
Inhibitor
Name:
BDBM50005463
Synonyms:
(R)-1H-Indole-2-carboxylic acid (1-methyl-2-oxo-5-phenyl-2,3-dihydro-1H-benzo[e][1,4]diazepin-3-yl)-amide: 0.1C4H10O (S)-N-(1-methyl-2-oxo-5-phenyl-2,3-dihydro-1H-benzo[e][1,4]diazepin-3-yl)-1H-indole-2-carboxamide 1H-Indole-2-carboxylic acid ((S)-1-methyl-2-oxo-5-phenyl-2,3-dihydro-1H-benzo[e][1,4]diazepin-3-yl)-amide 1H-Indole-2-carboxylic acid (1-methyl-2-oxo-5-phenyl-2,3-dihydro-1H-benzo[e][1,4]diazepin-3-yl)-amide (L-364,718 ((S)-devazepide) 1H-Indole-2-carboxylic acid (1-methyl-2-oxo-5-phenyl-2,3-dihydro-1H-benzo[e][1,4]diazepin-3-yl)-amide(Devazepide or (R) L364718) 1H-Indole-2-carboxylic acid (1-methyl-2-oxo-5-phenyl-2,3-dihydro-1H-benzo[e][1,4]diazepin-3-yl)-amide(devazepide) CCK antagonist synthetic 17 CHEMBL9506 L-364,718 MK-329
Type:
Small organic molecule
Emp. Form.:
C25H20N4O2
Mol. Mass.:
408.4519
SMILES:
CN1c2ccccc2C(=N[C@H](NC(=O)c2cc3ccccc3[nH]2)C1=O)c1ccccc1
: