Target
Alpha-1B adrenergic receptor
Ligand
BDBM50082877
Substrate
Meas. Tech.
ChEMBL_34328 (CHEMBL648111)
Ki
1700±n/a nM
Citation
 Wong, WCSun, WLagu, BTian, DMarzabadi, MRZhang, FNagarathnam, DMiao, SWWetzel, JMPeng, JForray, CChang, RSChen, TBRansom, RO'Malley, SBroten, TPKling, PVyas, KPZhang, KGluchowski, C Design and synthesis of novel alpha(1)(a) adrenoceptor-selective antagonists. 4. Structure-activity relationship in the dihydropyrimidine series. J Med Chem 42:4804-13 (1999)  
Target
Name:
Alpha-1B adrenergic receptor
Synonyms:
ADA1B_HUMAN Adrenergic alpha1B Adrenergic receptor alpha Alpha 1B-adrenoreceptor | Alpha-1B adrenergic receptor
Type:
Enzyme
Mol. Mass.:
56862.13
Organism:
Homo sapiens (Human)
Description:
P35368
Residue:
520
  
Inhibitor
Name:
BDBM50082877
Synonyms:
1-[(R)-5-(4-Cyano-4-phenyl-piperidin-1-yl)-4-methyl-pentyl]-6-(3,4-difluoro-phenyl)-2,4-dimethyl-1,6-dihydro-pyrimidine-5-carboxylic acid methyl ester | CHEMBL359430
Type:
Small organic molecule
Emp. Form.:
C32H38F2N4O2
Mol. Mass.:
548.6665
SMILES:
COC(=O)C1=C(C)N=C(C)N(CCC[C@@H](C)CN2CCC(CC2)(C#N)c2ccccc2)C1c1ccc(F)c(F)c1
: