Target
Alpha-1D adrenergic receptor
Ligand
BDBM50082866
Substrate
Meas. Tech.
ChEMBL_32430 (CHEMBL646092)
Ki
680±n/a nM
Citation
 Wong, WCSun, WLagu, BTian, DMarzabadi, MRZhang, FNagarathnam, DMiao, SWWetzel, JMPeng, JForray, CChang, RSChen, TBRansom, RO'Malley, SBroten, TPKling, PVyas, KPZhang, KGluchowski, C Design and synthesis of novel alpha(1)(a) adrenoceptor-selective antagonists. 4. Structure-activity relationship in the dihydropyrimidine series. J Med Chem 42:4804-13 (1999)  
Target
Name:
Alpha-1D adrenergic receptor
Synonyms:
ADA1D_HUMAN ADRA1D Adrenergic receptor alpha Alpha 1D-adrenoreceptor Alpha-1D adrenoceptor adrenergic Alpha1D
Type:
Enzyme Catalytic Domain
Mol. Mass.:
60485.82
Organism:
Homo sapiens (Human)
Description:
adrenergic Alpha1D ADRA1D HUMAN::P25100
Residue:
572
  
Inhibitor
Name:
BDBM50082866
Synonyms:
6-(3,4-Difluoro-phenyl)-1-[5-(4-methoxycarbonyl-4-phenyl-piperidin-1-yl)-pentyl]-2,4-dimethyl-1,6-dihydro-pyrimidine-5-carboxylic acid methyl ester | CHEMBL141322
Type:
Small organic molecule
Emp. Form.:
C32H39F2N3O4
Mol. Mass.:
567.6666
SMILES:
COC(=O)C1=C(C)N=C(C)N(CCCCCN2CCC(CC2)(C(=O)OC)c2ccccc2)C1c1ccc(F)c(F)c1
: