Target
D(4) dopamine receptor
Ligand
BDBM50083335
Substrate
Meas. Tech.
ChEMBL_63106 (CHEMBL674499)
Ki
18±n/a nM
Citation
 Belliotti, TRWustrow, DJBrink, WAZoski, KTShih, YHWhetzel, SZGeorgic, LMCorbin, AEAkunne, HCHeffner, TGPugsley, TAWise, LD A series of 6- and 7-piperazinyl- and -piperidinylmethylbenzoxazinones with dopamine D4 antagonist activity: discovery of a potential atypical antipsychotic agent. J Med Chem 42:5181-7 (2000)  
Target
Name:
D(4) dopamine receptor
Synonyms:
D(2C) dopamine receptor DOPAMINE D4.2 DRD4 Dopamine D4 receptor
Type:
Enzyme
Mol. Mass.:
48373.19
Organism:
Homo sapiens (Human)
Description:
P21917
Residue:
419
  
Inhibitor
Name:
BDBM50083335
Synonyms:
6-(4-Phenyl-piperazin-1-ylmethyl)-4H-benzo[1,4]oxazin-3-one | CHEMBL147130
Type:
Small organic molecule
Emp. Form.:
C19H21N3O2
Mol. Mass.:
323.3889
SMILES:
O=C1COc2ccc(CN3CCN(CC3)c3ccccc3)cc2N1
: