Target
Muscarinic acetylcholine receptor M5
Ligand
BDBM50083342
Substrate
Meas. Tech.
ChEMBL_139394 (CHEMBL747160)
Ki
964±n/a nM
Citation
 Belliotti, TRWustrow, DJBrink, WAZoski, KTShih, YHWhetzel, SZGeorgic, LMCorbin, AEAkunne, HCHeffner, TGPugsley, TAWise, LD A series of 6- and 7-piperazinyl- and -piperidinylmethylbenzoxazinones with dopamine D4 antagonist activity: discovery of a potential atypical antipsychotic agent. J Med Chem 42:5181-7 (2000)  
Target
Name:
Muscarinic acetylcholine receptor M5
Synonyms:
ACM5_HUMAN | CHRM5
Type:
PROTEIN
Mol. Mass.:
60102.35
Organism:
Homo sapiens (Human)
Description:
ChEMBL_1517990
Residue:
532
  
Inhibitor
Name:
BDBM50083342
Synonyms:
7-[4-(4-Chloro-phenyl)-piperazin-1-ylmethyl]-4H-benzo[1,4]oxazin-3-one | CHEMBL346389
Type:
Small organic molecule
Emp. Form.:
C19H20ClN3O2
Mol. Mass.:
357.834
SMILES:
Clc1ccc(cc1)N1CCN(Cc2ccc3NC(=O)COc3c2)CC1
: