Target
D(3) dopamine receptor
Ligand
BDBM50083339
Substrate
Meas. Tech.
ChEMBL_62112 (CHEMBL674990)
Ki
>3030±n/a nM
Citation
 Belliotti, TRWustrow, DJBrink, WAZoski, KTShih, YHWhetzel, SZGeorgic, LMCorbin, AEAkunne, HCHeffner, TGPugsley, TAWise, LD A series of 6- and 7-piperazinyl- and -piperidinylmethylbenzoxazinones with dopamine D4 antagonist activity: discovery of a potential atypical antipsychotic agent. J Med Chem 42:5181-7 (2000)  
Target
Name:
D(3) dopamine receptor
Synonyms:
DOPAMINE D3 DRD3_HUMAN Dopamine D3 receptor (D3) Dopamine receptor Dopamine receptor D3
Type:
Mol. Mass.:
44243.43
Organism:
Homo sapiens (Human)
Description:
Residue:
400
  
Inhibitor
Name:
BDBM50083339
Synonyms:
6-[4-(4-Methoxy-phenyl)-piperidin-1-ylmethyl]-4H-benzo[1,4]oxazin-3-one | CHEMBL146757
Type:
Small organic molecule
Emp. Form.:
C21H24N2O3
Mol. Mass.:
352.4269
SMILES:
COc1ccc(cc1)C1CCN(Cc2ccc3OCC(=O)Nc3c2)CC1
: