Target
Glutamyl aminopeptidase
Ligand
BDBM50083395
Substrate
Meas. Tech.
ChEMBL_32830 (CHEMBL873060)
Ki
27±n/a nM
Citation
 David, CBischoff, LMeudal, HMothé, ADe Mota, NDaNascimento, SLlorens-Cortes, CFournié-Zaluski, MCRoques, BP Investigation of subsite preferences in aminopeptidase A (EC 3.4.11.7) led to the design of the first highly potent and selective inhibitors of this enzyme. J Med Chem 42:5197-211 (2000)  
Target
Name:
Glutamyl aminopeptidase
Synonyms:
AMPE_HUMAN Aminopeptidase A Differentiation antigen gp160 ENPEP | Glutamyl aminopeptidase
Type:
PROTEIN
Mol. Mass.:
109226.47
Organism:
Homo sapiens (Human)
Description:
ChEMBL_32829
Residue:
957
  
Inhibitor
Name:
BDBM50083395
Synonyms:
1-{[1-(1,2-Dicarboxy-ethylcarbamoyl)-2-(4-hydroxy-phenyl)-ethylcarbamoyl]-mercapto-methyl}-3-sulfo-propyl-ammonium | CHEMBL151900
Type:
Small organic molecule
Emp. Form.:
C18H25N3O10S2
Mol. Mass.:
507.535
SMILES:
[NH3+][C@H](CCS([O-])(=O)=O)[C@H](S)C(=O)N[C@@H](Cc1ccc(O)cc1)C(=O)N[C@@H](CC(O)=O)C(O)=O
: