Target
Glutamyl aminopeptidase
Ligand
BDBM50083403
Substrate
Meas. Tech.
ChEMBL_32830 (CHEMBL873060)
Ki
13±n/a nM
Citation
 David, CBischoff, LMeudal, HMothé, ADe Mota, NDaNascimento, SLlorens-Cortes, CFournié-Zaluski, MCRoques, BP Investigation of subsite preferences in aminopeptidase A (EC 3.4.11.7) led to the design of the first highly potent and selective inhibitors of this enzyme. J Med Chem 42:5197-211 (2000)  
Target
Name:
Glutamyl aminopeptidase
Synonyms:
AMPE_HUMAN Aminopeptidase A Differentiation antigen gp160 ENPEP | Glutamyl aminopeptidase
Type:
PROTEIN
Mol. Mass.:
109226.47
Organism:
Homo sapiens (Human)
Description:
ChEMBL_32829
Residue:
957
  
Inhibitor
Name:
BDBM50083403
Synonyms:
3-Carboxy-1-{[1-(1,2-dicarboxy-ethylcarbamoyl)-2-methyl-butylcarbamoyl]-mercapto-methyl}-propyl-ammonium | CHEMBL346397
Type:
Small organic molecule
Emp. Form.:
C16H27N3O8S
Mol. Mass.:
421.466
SMILES:
CC[C@@H](C)[C@H](NC(=O)[C@H](S)[C@@H]([NH3+])CCC([O-])=O)C(=O)N[C@@H](CC(O)=O)C(O)=O
: