Target
P2Y purinoceptor 1
Ligand
BDBM50422304
Substrate
Meas. Tech.
ChEMBL_147714 (CHEMBL759184)
EC50
18±n/a nM
Citation
 Halbfinger, EMajor, DTRitzmann, MUbl, JReiser, GBoyer, JLHarden, KTFischer, B Molecular recognition of modified adenine nucleotides by the P2Y(1)-receptor. 1. A synthetic, biochemical, and NMR approach. J Med Chem 42:5325-37 (2000)  
Target
Name:
P2Y purinoceptor 1
Synonyms:
P2RY1 | P2RY1_MELGA
Type:
Mol. Mass.:
41199.64
Organism:
Meleagris gallopavo
Description:
Residue:
362
  
Inhibitor
Name:
BDBM50422304
Synonyms:
CHEMBL2364567
Type:
Small organic molecule
Emp. Form.:
C14H20N5O13P3S
Mol. Mass.:
591.323
SMILES:
CCCCSc1nc(N)c2ncn([C@@H]3O[C@H](COP([O-])(=O)OP([O-])(=O)OP([O-])([O-])=O)[C@@H](O)[C@H]3O)c2n1
: