Target
Muscarinic acetylcholine receptor M1
Ligand
BDBM50073457
Substrate
Meas. Tech.
ChEMBL_138287 (CHEMBL744319)
IC50
40.0±n/a nM
Citation
 Augelli-Szafran, CEBlankley, CJJaen, JCMoreland, DWNelson, CBPenvose-Yi, JRSchwarz, RDThomas, AJ Identification and characterization of m1 selective muscarinic receptor antagonists1. J Med Chem 42:356-63 (1999)  
Target
Name:
Muscarinic acetylcholine receptor M1
Synonyms:
ACM1_HUMAN Cholinergic receptor, muscarinic 1 | Cholinergic, muscarinic M1
Type:
Protein
Mol. Mass.:
51442.54
Organism:
Homo sapiens (Human)
Description:
P11229
Residue:
460
  
Inhibitor
Name:
BDBM50073457
Synonyms:
(D,L) 1-Ethyl-4-phenyl-1,2,3,6-tetrahydro-pyridine-3-carboxylic acid hexyl ester; compound with 2,3-dihydroxy-succinic acid CHEMBL333065
Type:
Small organic molecule
Emp. Form.:
C20H29NO2
Mol. Mass.:
315.4498
SMILES:
CCCCCCOC(=O)C1CN(CC)CC=C1c1ccccc1
: