Target
Muscarinic acetylcholine receptor M1
Ligand
BDBM50073476
Substrate
Meas. Tech.
ChEMBL_138287 (CHEMBL744319)
IC50
105±n/a nM
Citation
 Augelli-Szafran, CEBlankley, CJJaen, JCMoreland, DWNelson, CBPenvose-Yi, JRSchwarz, RDThomas, AJ Identification and characterization of m1 selective muscarinic receptor antagonists1. J Med Chem 42:356-63 (1999)  
Target
Name:
Muscarinic acetylcholine receptor M1
Synonyms:
ACM1_HUMAN Cholinergic receptor, muscarinic 1 | Cholinergic, muscarinic M1
Type:
Protein
Mol. Mass.:
51442.54
Organism:
Homo sapiens (Human)
Description:
P11229
Residue:
460
  
Inhibitor
Name:
BDBM50073476
Synonyms:
1-Ethyl-4-phenyl-1,2,3,6-tetrahydro-pyridine-3-carboxylic acid 2-cyclohexyl-ethyl ester; oxalic acid | CHEMBL120599
Type:
Small organic molecule
Emp. Form.:
C22H31NO2
Mol. Mass.:
341.487
SMILES:
CCN1CC=C(C(C1)C(=O)OCCC1CCCCC1)c1ccccc1
: