Target
Muscarinic acetylcholine receptor M2
Ligand
BDBM50073486
Substrate
Meas. Tech.
ChEMBL_139631 (CHEMBL748244)
IC50
2214±n/a nM
Citation
 Augelli-Szafran, CEBlankley, CJJaen, JCMoreland, DWNelson, CBPenvose-Yi, JRSchwarz, RDThomas, AJ Identification and characterization of m1 selective muscarinic receptor antagonists1. J Med Chem 42:356-63 (1999)  
Target
Name:
Muscarinic acetylcholine receptor M2
Synonyms:
ACM2_HUMAN Cholinergic, muscarinic M2 Muscarinic acetylcholine receptor M2 and M5 | RecName: Full=Muscarinic acetylcholine receptor M2
Type:
GPCR
Mol. Mass.:
51730.61
Organism:
Homo sapiens (Human)
Description:
P08172
Residue:
466
  
Inhibitor
Name:
BDBM50073486
Synonyms:
1-Ethyl-4-phenyl-1,2,3,6-tetrahydro-pyridine-3-carboxylic acid 3-phenyl-propyl ester; hydrochloride | CHEMBL540316
Type:
Small organic molecule
Emp. Form.:
C23H27NO2
Mol. Mass.:
349.466
SMILES:
CCN1CC=C(C(C1)C(=O)OCCCc1ccccc1)c1ccccc1
: