Target
Muscarinic acetylcholine receptor M3
Ligand
BDBM50073461
Substrate
Meas. Tech.
ChEMBL_138585 (CHEMBL746513)
IC50
1601±n/a nM
Citation
 Augelli-Szafran, CEBlankley, CJJaen, JCMoreland, DWNelson, CBPenvose-Yi, JRSchwarz, RDThomas, AJ Identification and characterization of m1 selective muscarinic receptor antagonists1. J Med Chem 42:356-63 (1999)  
Target
Name:
Muscarinic acetylcholine receptor M3
Synonyms:
ACM3_HUMAN Cholinergic, muscarinic M3 Muscarinic receptor M3 | RecName: Full=Muscarinic acetylcholine receptor M3
Type:
Enzyme
Mol. Mass.:
66151.03
Organism:
Homo sapiens (Human)
Description:
P20309
Residue:
590
  
Inhibitor
Name:
BDBM50073461
Synonyms:
1-Ethyl-4-phenyl-1,2,3,6-tetrahydro-pyridine-3-carboxylic acid nonyl ester | CHEMBL120972
Type:
Small organic molecule
Emp. Form.:
C23H35NO2
Mol. Mass.:
357.5295
SMILES:
CCCCCCCCCOC(=O)C1CN(CC)CC=C1c1ccccc1
: