Target
Muscarinic acetylcholine receptor M5
Ligand
BDBM50073501
Substrate
Meas. Tech.
ChEMBL_139388 (CHEMBL747701)
IC50
25±n/a nM
Citation
 Augelli-Szafran, CEBlankley, CJJaen, JCMoreland, DWNelson, CBPenvose-Yi, JRSchwarz, RDThomas, AJ Identification and characterization of m1 selective muscarinic receptor antagonists1. J Med Chem 42:356-63 (1999)  
Target
Name:
Muscarinic acetylcholine receptor M5
Synonyms:
ACM5_HUMAN | CHRM5
Type:
PROTEIN
Mol. Mass.:
60102.35
Organism:
Homo sapiens (Human)
Description:
ChEMBL_1517990
Residue:
532
  
Inhibitor
Name:
BDBM50073501
Synonyms:
1-Ethyl-4-phenyl-1,2,5,6-tetrahydro-pyridine-3-carboxylic acid 2-p-tolyl-ethyl ester; oxalic acid CHEMBL120119
Type:
Small organic molecule
Emp. Form.:
C23H27NO2
Mol. Mass.:
349.466
SMILES:
CCN1CCC(=C(C1)C(=O)OCCc1ccc(C)cc1)c1ccccc1
: