Target
Muscarinic acetylcholine receptor M3
Ligand
BDBM50073462
Substrate
Meas. Tech.
ChEMBL_138585 (CHEMBL746513)
IC50
6712±n/a nM
Citation
 Augelli-Szafran, CEBlankley, CJJaen, JCMoreland, DWNelson, CBPenvose-Yi, JRSchwarz, RDThomas, AJ Identification and characterization of m1 selective muscarinic receptor antagonists1. J Med Chem 42:356-63 (1999)  
Target
Name:
Muscarinic acetylcholine receptor M3
Synonyms:
ACM3_HUMAN Cholinergic, muscarinic M3 Muscarinic receptor M3 | RecName: Full=Muscarinic acetylcholine receptor M3
Type:
Enzyme
Mol. Mass.:
66151.03
Organism:
Homo sapiens (Human)
Description:
P20309
Residue:
590
  
Inhibitor
Name:
BDBM50073462
Synonyms:
1-Ethyl-3-(3-pentyl-[1,2,4]oxadiazol-5-yl)-4-phenyl-1,2,3,6-tetrahydro-pyridine; oxalic acid | CHEMBL332405
Type:
Small organic molecule
Emp. Form.:
C20H27N3O
Mol. Mass.:
325.4479
SMILES:
CCCCCc1noc(n1)C1CN(CC)CC=C1c1ccccc1
: