Target
Muscarinic acetylcholine receptor M2
Ligand
BDBM50073468
Substrate
Meas. Tech.
ChEMBL_139631 (CHEMBL748244)
IC50
73±n/a nM
Citation
 Augelli-Szafran, CEBlankley, CJJaen, JCMoreland, DWNelson, CBPenvose-Yi, JRSchwarz, RDThomas, AJ Identification and characterization of m1 selective muscarinic receptor antagonists1. J Med Chem 42:356-63 (1999)  
Target
Name:
Muscarinic acetylcholine receptor M2
Synonyms:
ACM2_HUMAN Cholinergic, muscarinic M2 Muscarinic acetylcholine receptor M2 and M5 | RecName: Full=Muscarinic acetylcholine receptor M2
Type:
GPCR
Mol. Mass.:
51730.61
Organism:
Homo sapiens (Human)
Description:
P08172
Residue:
466
  
Inhibitor
Name:
BDBM50073468
Synonyms:
1-Ethyl-4-phenyl-1,2,5,6-tetrahydro-pyridine-3-carboxylic acid heptyl ester; oxalic acid | CHEMBL334245
Type:
Small organic molecule
Emp. Form.:
C21H31NO2
Mol. Mass.:
329.4763
SMILES:
CCCCCCCOC(=O)C1=C(CCN(CC)C1)c1ccccc1
: