Target
Integrase
Ligand
BDBM50073623
Substrate
Meas. Tech.
ChEMBL_88621 (CHEMBL701725)
IC50
1030±n/a nM
Citation
 King, PJMa, GMiao, WJia, QMcDougall, BRReinecke, MGCornell, CKuan, JKim, TRRobinson, WE Structure-activity relationships: analogues of the dicaffeoylquinic and dicaffeoyltartaric acids as potent inhibitors of human immunodeficiency virus type 1 integrase and replication. J Med Chem 42:497-509 (1999)  
Target
Name:
Integrase
Synonyms:
Human immunodeficiency virus type 1 integrase
Type:
PROTEIN
Mol. Mass.:
32231.48
Organism:
Human immunodeficiency virus 1
Description:
ChEMBL_90865
Residue:
288
  
Inhibitor
Name:
BDBM50073623
Synonyms:
(E)-3-(3,4-Dihydroxy-phenyl)-acrylic acid 4-[(E)-3-(3,4-dihydroxy-phenyl)-acryloyloxy]-cyclohexyl ester | CHEMBL149826
Type:
Small organic molecule
Emp. Form.:
C24H24O8
Mol. Mass.:
440.4426
SMILES:
Oc1ccc(\C=C\C(=O)OC2CCC(CC2)OC(=O)\C=C\c2ccc(O)c(O)c2)cc1O
: