Target
cGMP-specific 3',5'-cyclic phosphodiesterase
Ligand
BDBM50074895
Substrate
Meas. Tech.
ChEMBL_155195 (CHEMBL763668)
IC50
10000±n/a nM
Citation
 Ukita, TSugahara, MTerakawa, YKuroda, TWada, KNakata, AOhmachi, YKikkawa, HIkezawa, KNaito, K Novel, potent, and selective phosphodiesterase-4 inhibitors as antiasthmatic agents: synthesis and biological activities of a series of 1-pyridylnaphthalene derivatives. J Med Chem 42:1088-99 (1999)  
Target
Name:
cGMP-specific 3',5'-cyclic phosphodiesterase
Synonyms:
3',5'-cyclic phosphodiesterase PDE5 PDE5A_HUMAN Phosphodiesterase 5 (PDE5) Phosphodiesterase 5A (PDE5A) cGMP-specific 3',5'-cyclic phosphodiesterase
Type:
Protein
Mol. Mass.:
99975.83
Organism:
Homo sapiens (Human)
Description:
O76074
Residue:
875
  
Inhibitor
Name:
BDBM50074895
Synonyms:
2-[4-(2,3-Bis-hydroxymethyl-naphthalen-1-yl)-pyridin-2-yl]-4-pyridin-3-yl-2H-phthalazin-1-one; hydrochloride | CHEMBL553539
Type:
Small organic molecule
Emp. Form.:
C30H22N4O3
Mol. Mass.:
486.5207
SMILES:
OCc1cc2ccccc2c(c1CO)-c1ccnc(c1)-n1nc(-c2cccnc2)c2ccccc2c1=O
: