Target
Sodium-dependent serotonin transporter
Ligand
BDBM50076397
Substrate
Meas. Tech.
ChEMBL_201828 (CHEMBL805335)
Ki
1100±n/a nM
Citation
 Cappelli, AAnzini, MVomero, SCanullo, LMennuni, LMakovec, FDoucet, EHamon, MMenziani, MCDe Benedetti, PGBruni, GRomeo, MRGiorgi, GDonati, A Novel potent and selective central 5-HT3 receptor ligands provided with different intrinsic efficacy. 2. Molecular basis of the intrinsic efficacy of arylpiperazine derivatives at the central 5-HT3 receptors. J Med Chem 42:1556-75 (1999)  
Target
Name:
Sodium-dependent serotonin transporter
Synonyms:
5-HT Transporter 5HT transporter Anandamid membrane transporter, AMT Monoamine transporters; Norepinephrine & serotonin Slc6a4 Sodium-dependent serotonin transporter (SERT) | imipramine receptor
Type:
Multi-pass membrane protein
Mol. Mass.:
70168.43
Organism:
Rattus norvegicus (rat)
Description:
P31652
Residue:
630
  
Inhibitor
Name:
BDBM50076397
Synonyms:
Benzoic acid 2-(4-methyl-piperazin-1-yl)-4-phenyl-quinolin-3-ylmethyl ester | CHEMBL43304
Type:
Small organic molecule
Emp. Form.:
C28H27N3O2
Mol. Mass.:
437.5329
SMILES:
CN1CCN(CC1)c1nc2ccccc2c(-c2ccccc2)c1COC(=O)c1ccccc1
: