Target
5-hydroxytryptamine receptor 2A
Ligand
BDBM50076397
Substrate
Meas. Tech.
ChEMBL_2628 (CHEMBL621540)
Ki
>10000±n/a nM
Citation
 Cappelli, AAnzini, MVomero, SCanullo, LMennuni, LMakovec, FDoucet, EHamon, MMenziani, MCDe Benedetti, PGBruni, GRomeo, MRGiorgi, GDonati, A Novel potent and selective central 5-HT3 receptor ligands provided with different intrinsic efficacy. 2. Molecular basis of the intrinsic efficacy of arylpiperazine derivatives at the central 5-HT3 receptors. J Med Chem 42:1556-75 (1999)  
Target
Name:
5-hydroxytryptamine receptor 2A
Synonyms:
5-HT-2A 5-HT2A 5-hydroxytryptamine receptor 2A (5HT2A) Htr2 Serotonin Receptor 2A
Type:
G Protein-Coupled Receptor (GPCR)
Mol. Mass.:
52852.05
Organism:
Rattus norvegicus (rat)
Description:
Rat cortex membranes 5-HT2A receptors.
Residue:
471
  
Inhibitor
Name:
BDBM50076397
Synonyms:
Benzoic acid 2-(4-methyl-piperazin-1-yl)-4-phenyl-quinolin-3-ylmethyl ester | CHEMBL43304
Type:
Small organic molecule
Emp. Form.:
C28H27N3O2
Mol. Mass.:
437.5329
SMILES:
CN1CCN(CC1)c1nc2ccccc2c(-c2ccccc2)c1COC(=O)c1ccccc1
: