Target
P2Y purinoceptor 1
Ligand
BDBM50076465
Substrate
Meas. Tech.
ChEMBL_147722 (CHEMBL759192)
IC50
>100000±n/a nM
Citation
 Nandanan, ECamaioni, EJang, SYKim, YCCristalli, GHerdewijn, PSecrist, JATiwari, KNMohanram, AHarden, TKBoyer, JLJacobson, KA Structure-activity relationships of bisphosphate nucleotide derivatives as P2Y1 receptor antagonists and partial agonists. J Med Chem 42:1625-38 (1999)  
Target
Name:
P2Y purinoceptor 1
Synonyms:
P2RY1 | P2RY1_MELGA
Type:
Mol. Mass.:
41199.64
Organism:
Meleagris gallopavo
Description:
Residue:
362
  
Inhibitor
Name:
BDBM50076465
Synonyms:
CHEMBL44317 | Phosphoric acid mono-[5-(6-methoxyamino-purin-9-yl)-2-phosphonooxymethyl-tetrahydro-furan-3-yl] ester
Type:
Small organic molecule
Emp. Form.:
C11H17N5O10P2
Mol. Mass.:
441.2277
SMILES:
CONc1ncnc2n(cnc12)C1CC(OP(O)(O)=O)C(COP(O)(O)=O)O1
: