Target
GABA-A receptor; alpha-5/beta-3/gamma-2
Ligand
BDBM85042
Substrate
Meas. Tech.
ChEMBL_70695 (CHEMBL681480)
Ki
0.20±n/a nM
Citation
 Huang, QHe, XMa, CLiu, RYu, SDayer, CAWenger, GRMcKernan, RCook, JM Pharmacophore/receptor models for GABA(A)/BzR subtypes (alpha1beta3gamma2, alpha5beta3gamma2, and alpha6beta3gamma2) via a comprehensive ligand-mapping approach. J Med Chem 43:71-95 (2000)  
Target
Name:
GABA-A receptor; alpha-5/beta-3/gamma-2
Synonyms:
GABA receptor alpha-5/beta-3/gamma-2 subunit | Gamma-aminobutyric acid receptor subunit alpha-5/beta-3/gamma-2
Type:
Mol. Mass.:
Description:
ASSAY_ID of ChEMBL is 2148177
Components:
This complex has 3 components.
Component 1
Name:
Gamma-aminobutyric acid receptor subunit gamma-2
Synonyms:
GABA(A) receptor subunit gamma-2 GBRG2_HUMAN
Type:
PROTEIN
Mol. Mass.:
54172.74
Organism:
Homo sapiens (Human)
Description:
EBI_217
Residue:
467
  
Component 2
Name:
Gamma-aminobutyric acid receptor subunit beta-3
Synonyms:
GABA A receptor alpha-4/beta-3/gamma-2 GABA-A receptor GBRB3_HUMAN | agonist GABA site
Type:
PROTEIN
Mol. Mass.:
54130.51
Organism:
Homo sapiens (Human)
Description:
ChEMBL_448071
Residue:
473
  
Component 3
Name:
Gamma-aminobutyric acid receptor subunit alpha-5
Synonyms:
GABA receptor alpha-5 subunit GABRA5 Gamma-aminobutyric acid receptor subunit alpha-5 (GABA(A)) | Gamma-aminobutyric acid receptor subunit alpha-5 (GABAA)
Type:
Enzyme
Mol. Mass.:
52160.59
Organism:
Homo sapiens (Human)
Description:
P31644
Residue:
462
  
Inhibitor
Name:
BDBM85042
Synonyms:
CHEMBL44613 | PW-007A
Type:
Small organic molecule
Emp. Form.:
C17H13N3O2
Mol. Mass.:
291.304
SMILES:
COc1ccc2ncc3c([nH]n(-c4ccccc4)c3=O)c2c1
: